Hydraulic conductivity
type: Concept
alternative label: HydrCond
broader: https://sms-cv.helmholtz.cloud/sms/cv/api/v1/samplingmedia/10/
definition: Hydraulic conductivity, symbolically represented as K, is a property of vascular plants, soils and rocks, that describes the ease with which a fluid (usually water) can move through pore spaces or fractures. It depends on the intrinsic permeability of the material, the degree of saturation, and on the density and viscosity of the fluid.