Gage height
type: Concept
alternative label: GageHeigh
broader: https://sms-cv.helmholtz.cloud/sms/cv/api/v1/samplingmedia/7/
definition: Water level with regard to an arbitrary gage datum (also see Water depth for comparison)