Evapotranspiration, potential
type: Concept
definition: The amount of water that could be evaporated and transpired if there was sufficient water available.
broader: https://sms-cv.helmholtz.cloud/sms/cv/api/v1/samplingmedia/7/
alternative label: EvapoTPot