Distance
type: Concept
broader: https://sms-cv.helmholtz.cloud/sms/cv/api/v1/samplingmedia/12/
definition: Distance measured from a sensor to a target object such as the surface of a water body or snow surface.