Air density
type: Concept
alternative label: Density
broader: https://sms-cv.helmholtz.cloud/sms/cv/api/v1/samplingmedia/9/
definition: The density of air or atmospheric density is the mass per unit volume of Earth's atmosphere.