Canopy height
type: Concept
definition: Forest canopy density and height are used as variables in a number of environmental applications, such as biomass estimation, vegetation coverage, and biodiversity determination. Canopy density, or canopy cover, is the ratio of vegetation to ground as seen from the air. Canopy height measures how far above the ground the top of the canopy is. Lidar can be used to determine both of these variables.
broader: https://sms-cv.helmholtz.cloud/sms/cv/api/v1/samplingmedia/4/
alternative label: CanoHt