Canopy closure
type: Concept
alternative label: CanoClos
broader: https://sms-cv.helmholtz.cloud/sms/cv/api/v1/samplingmedia/4/
definition: Crown closure is a term used in forestry. Crown closure and crown cover are two slightly different measures of the forest canopy and that determine the amount of light able to penetrate to the forest floor.