Voltage, battery
type: Concept
definition: Voltage of battery. Typically equal to supply voltage of loggers or devices. Sometimes separatly measured, e.g. voltage of lithium batterys in computers.
broader: https://sms-cv.helmholtz.cloud/sms/cv/api/v1/samplingmedia/1/
alternative label: Battery voltage
alternative label: BattVolt