Vegetation height
type: Concept
broader: https://sms-cv.helmholtz.cloud/sms/cv/api/v1/samplingmedia/4/
definition: Sensor e.g. ultrasonic measurement device. Therefore p.r.n estimation of snow height instead of vegetation height in winter.