Time
type: Concept
alternative label: Time Stamp
broader: https://sms-cv.helmholtz.cloud/sms/cv/api/v1/samplingmedia/8/
definition: Ideally time format according to ISO 8601 (HH=hour, MM=minute, SS=second).