Temperature, data logger
type: Concept
definition: Operating parameter of a data logger. Internal temperature data logger.
broader: https://sms-cv.helmholtz.cloud/sms/cv/api/v1/samplingmedia/1/
alternative label: Temperature, datalogger
alternative label: TLogger