Soil moisture
type: Concept
alternative label: Soil volumetric water content
alternative label: VWC
broader: https://sms-cv.helmholtz.cloud/sms/cv/api/v1/samplingmedia/6/
definition: The total amount of water, including the water vapor, in an unsaturated soil.