Relative humidity
type: Concept
alternative label: RelHumid
broader: https://sms-cv.helmholtz.cloud/sms/cv/api/v1/samplingmedia/9/
definition: The ratio of the amount of water vapour in the air compared to the maximum amount of water vapour that can theoretically be held at the air's temperature.