Radiation PAR, in
type: Concept
definition: Photosynthetically Active Radiation downward
broader: https://sms-cv.helmholtz.cloud/sms/cv/api/v1/samplingmedia/9/
alternative label: RadInPAR
alternative label: Radiation, incoming PAR