Quality flag
type: Concept
broader: https://sms-cv.helmholtz.cloud/sms/cv/api/v1/samplingmedia/1/
definition: Please note in the sensor description to which value the quality flag belongs and what it means.