Precipitation type
type: Concept
broader: https://sms-cv.helmholtz.cloud/sms/cv/api/v1/samplingmedia/9/
definition: Coded value for the type of precipitation. Please note the type of sensor to enable the decoding.